{"text_format":"1","workbook":"xlsx","n_sheets":7,"sheets":["Cover Sheet","Instructions","LA Table","Schools Table","Early Years Table","Admin","Prev_LA_Table"],"not_rendered":{"charts":0,"images":16,"macros":1,"external_links":0,"defined_names":17,"comments":3,"pivot_tables":0},"unopened":[],"bounds":{"document_bytes":16777216,"sheet_cells":100000,"rows_first":2000,"rows_last":500,"rows_between":2000,"halvings":0,"cell_chars":16384,"cell_head_chars":4096},"cells_cut":0,"cells_raw":0,"read":"whole","date_system":"1900"}

{"sheet":"Cover Sheet","index":0,"n_rows":21,"n_cols":4,"rows_kept":21,"cut":false,"hidden":false,"merged":[]}
[]
[]
[]
[]
[]
[null,null,null,"Section 251 budget 2019-20"]
[null,null,null,"XML generator"]
[]
[]
[]
[]
[]
[null,"Local Authority Name:",{"$f":"VLOOKUP(C15, PrevYrData, 2, FALSE)","v":"Sheffield"}]
[]
[null,"Local Authority Number:",373]
{"$rows_left_out":7}
{"sheet":"Instructions","index":1,"n_rows":265,"n_cols":2,"rows_kept":265,"cut":false,"hidden":false,"merged":[]}
[]
[null,"Completing the Return"]
[]
[null,"You can view guidance by hovering over cells with a red triangle in the top-right corner. If you need to resize a comment, you can do so by going to Review>Edit Comment. You are also advised to read the full guidance at: https://www.gov.uk/guidance/section-251-2019-to-2020."]
[]
[null,"LA Table"]
[]
[null,"This table is for local authorities to provide an overall picture of the funding being allocated direct to schools, the amount being spent on education centrally and the amount being spent on children’s and young people’s services."]
[]
[null,"Values should be entered in all red cells. If the value entered does not match the data validation restrictions for the cell, an error message will be displayed. You will still be able to submit your return, but you will be prompted to enter an explanation within COLLECT."]
[]
[null,"Queries will be displayed in column O if the gross value is outside the expected range when compared with the previous year’s data."]
[]
[null,"Schools Table"]
[]
{"$rows_left_out":251}
{"sheet":"LA Table","index":2,"n_rows":224,"n_cols":20,"rows_kept":224,"cut":false,"hidden":false,"merged":[[223,14,226,14]]}
[]
[null,null,"LA Table:  Local Authority Information"]
[]
[null,null,"Description",null,"Early Years","Primary","Secondary","SEN/    Special schools","AP/    PRUs","Post school (e.g. Sixth Form & FE Colleges)","Gross","Income","Net",null,"Error",null,"Err_311","Err_1001","Err_1007","Err_Misc"]
[]
[null,null,null,null,{"$f":"IF(COUNTA(E10:L221)<456,\"PLEASE ENTER VALUES IN ALL CELLS\",\"\")","v":"PLEASE ENTER VALUES IN ALL CELLS"}]
[null,1,"SCHOOLS BUDGET"]
[]
[null,null,null,null,null,null,null,null,null,null,null,null,null,null,{"$f":"IF(M11<(SUM(TotalPlaceFundingNet) - SUM(TotalDeductionsESG)), \"LA Table line 1.0.2 gross value must be greater than or equal to total place funding on Schools Table (net of any deductions).\", \"\")","v":""}]
[null,"1.0.1","Individual Schools Budget (i.e. school budget shares, before Academy recoupment), including 6th form grant for maintained schools, but excluding all high needs place funding ",null,31687252,183386140,146863741,null,null,null,{"$f":"SUM(E10,F10,G10,H10,I10)","v":361937133},null,{"$f":"SUM(E10,F10,G10,H10,I10)","v":361937133},{"$f":"IsRed(E10)+2*IsRed(F10)+4*IsRed(G10)+8*IsRed(H10)+16*IsRed(I10)+32*IsRed(J10)+64*IsRed(K10)+ 128*IsRed(L10)","v":7},{"$f":"ValErrMsg(0,R10,0,0)","v":""},{"$f":"Prev_LA_Table!H10","v":350433391},{"$f":"ValSP311(K10,P10)","v":0},{"$f":"ValSP1001(K10,P10)","v":0},{"$f":"ValSP1007(K10,P10)","v":0}]
[null,"1.0.2","High needs place funding within Individual Schools Budget (i.e. within school budget shares, before Academy recoupment), including all pre- and post-16 place funding for maintained schools and academies",null,0,792000,486000,12475000,1800000,null,{"$f":"SUM(E11,F11,G11,H11,I11)","v":15553000},null,{"$f":"SUM(E11,F11,G11,H11,I11)","v":15553000},{"$f":"IsRed(E11)+2*IsRed(F11)+4*IsRed(G11)+8*IsRed(H11)+16*IsRed(I11)+32*IsRed(J11)+64*IsRed(K11)+ 128*IsRed(L11)","v":31},{"$f":"ValErrMsg(0,R11,0,T11)","v":"1001: Check - Value in 2019-20 is between 10% greater or 30% less than in 2018-19"},{"$f":"Prev_LA_Table!H11","v":14127417},{"$f":"ValSP311(K11,P11)","v":0},{"$f":"ValSP1001(K11,P11)","v":1},{"$f":"ValSP1007(K11,P11)","v":0},{"$f":"IF(K11<SUM(TotalPlaceFundingNet)-SUM(TotalDeductionsESG), 1022, 0)","v":0}]
[]
[null,null,"DEDELEGATED ITEMS      "]
[null,"1.1.1","Contingencies      ",null,null,245291,8835,null,null,null,{"$f":"SUM(F14,G14)","v":254126},0,{"$f":"K14-L14","v":254126},{"$f":"IsRed(E14)+2*IsRed(F14)+4*IsRed(G14)+8*IsRed(H14)+16*IsRed(I14)+32*IsRed(J14)+64*IsRed(K14)+ 128*IsRed(L14)","v":134},{"$f":"ValErrMsg(Q14,0, S14)","v":""},{"$f":"Prev_LA_Table!H15","v":287828},{"$f":"ValSP311(K14,P14)","v":0},null,{"$f":"ValSP1007(K14,P14)","v":0}]
[null,"1.1.2","Behaviour support services",null,null,0,0,null,null,null,0,0,0,134,{"$f":"ValErrMsg(Q15,0, S15)","v":""},{"$f":"Prev_LA_Table!H16","v":0},0,null,0]
{"$rows_left_out":210}
{"sheet":"Schools Table","index":3,"n_rows":210,"n_cols":40,"rows_kept":210,"cut":false,"hidden":false,"merged":[[3,19,4,19],[3,1,4,1],[3,2,4,17],[6,12,6,13],[6,19,7,19],[6,1,7,3],[6,4,7,4],[6,5,7,5],[6,6,6,7],[6,9,6,10],[6,17,7,17]]}
[]
[null,null,null,null,null,null,null,null,null,null,null,null,null,null,null,null,"Schools Table: High Needs Places in Maintained Schools"]
[]
[null,"Schools Table Notes:",null,null,null,null,null,null,null,null,null,null,null,null,null,null,null,null,null,{"$f":"IF(U4=\"error\",\"You have entered too many characters for this field. The maximum is 4000. You have entered \" &V4,\"\")","v":""},{"$f":"IF(V4>4000,\"error\",\"\")","v":""}]
[]
[]
[null,"Special Schools / Pupil Referral Units / Hospital Schools / Special units and resourced provision in mainstream schools",null,null,"SCHOOL / UNIT OPENING / CLOSING","DATE OPENING / CLOSING","Special educational needs (SEN) places  ",null,"SEN place funding","Alternative provision (AP) places",null,"AP place funding","Hospital education places  ",null,"Hospital education place funding","Total Place funding         net ","Total deduction for services to maintained schools formerly funded through the ESG","Comments",null,"Error(s) - copy/paste the cell into another document to view all"]
[null,null,null,null,null,null,"April 2019 to August 2019","September 2019 to March 2020","April 2019 To March 2020","April 2019 to August 2019","September 2019 to March 2020","April 2019 To March 2020","April 2019 to August 2019","September 2019 to March 2020","April 2019 To March 2020","April 2019 To March 2020","April 2019 To March 2020",null,null,null,"Error Number",null,null,null,null,"* Need clarification on 'Total budget share'"]
[null,"School Name","DfE Number","School Type",null,null,null,null,"£",null,null,"£",null,null,"£",null,"£",null,null,null,null,"Data Entry",1.1000000000000001,1.2,1.3,2.11,2.12,2.5,"2.10.1","2.9.1",1002,1003,1004,1005,1011,1012,1013,1020,1022,1024]
[null,"Seven Hills School",7043,"Special",null,null,165,165,1650000,0,0,0,0,0,0,{"$f":"IF(OR(I10<>\"\",L10<>\"\",O10<>\"\"),SUM(I10,L10,O10),\"\")","v":1650000},0,null,null,{"$f":"ValSP_SchoolErrorMessage(V10,W10,X10,Y10,Z10,AA10,AB10,AC10,AD10,AE10,AF10,AG10,AH10,AI10,AJ10,AK10,AL10,AM10,AN10)","v":""},null,{"$f":"NonNull(B10:Q10)","v":1},{"$f":"IF($V10<>0,OR(Valsp11(C10),Valsp11(Q10)))","v":false},{"$f":"AND(V10=1,COUNTIF($C$10:$C$210,C10) > 1)","v":false},{"$f":"IF($V10<>0, OR(Valsp13(G10), Valsp13(H10), Valsp13(J10), Valsp13(K10), Valsp13(M10), Valsp13(N10), Valsp13(Q10)))","v":false},{"$f":"IF($V10<>0, Valsp211(C10,0))","v":false},{"$f":"IF($V10<>0, Valsp212(B10, G10+H10+J10+K10+M10+N10))","v":false},{"$f":"IF($V10<>0, Valsp25(C10))","v":false},{"$f":"IF($V10<>0,Valsp2101(F10))","v":false},{"$f":"IF($V10<>0,Valsp291(E10,F10))","v":false},{"$f":"IF($V10<>0, Valsp1002(G10+H10+J10+K10+M10+N10))","v":false},{"$f":"IF($V10<>0, Valsp1003(D10,G10,H10,I10))","v":false},{"$f":"IF($V10<>0, Valsp1004(J10,K10,L10))","v":false},{"$f":"IF($V10<>0, Valsp1005(M10,N10,O10))","v":false},{"$f":"IF($V10<>0, Valsp1011(C10,E10,P10))","v":false},{"$f":"IF($V10<>0, OR(Valsp1012(G10+H10,I10), Valsp1012(J10+K10,L10), Valsp1012(M10+N10,O10)))","v":false},0,{"$f":"IF($V10<>0, Valsp1020(D10,Q10))","v":false},0,{"$f":"IF($V10<>0,Valsp1024(D10,G10,H10,I10))","v":false}]
[null,"Holgate Meadows School",7041,"Special",null,null,101,101,1010000,0,0,0,0,0,0,1010000,0,null,null,{"$f":"ValSP_SchoolErrorMessage(V11,W11,X11,Y11,Z11,AA11,AB11,AC11,AD11,AE11,AF11,AG11,AH11,AI11,AJ11,AK11,AL11,AM11,AN11)","v":""},null,{"$f":"NonNull(B11:Q11)","v":1},{"$f":"IF($V11<>0,OR(Valsp11(C11),Valsp11(Q11)))","v":false},{"$f":"AND(V11=1,COUNTIF($C$10:$C$210,C11) > 1)","v":false},false,{"$f":"IF($V11<>0, Valsp211(C11,0))","v":false},{"$f":"IF($V11<>0, Valsp212(B11, G11+H11+J11+K11+M11+N11))","v":false},{"$f":"IF($V11<>0, Valsp25(C11))","v":false},{"$f":"IF($V11<>0,Valsp2101(F11))","v":false},{"$f":"IF($V11<>0,Valsp291(E11,F11))","v":false},{"$f":"IF($V11<>0, Valsp1002(G11+H11+J11+K11+M11+N11))","v":false},{"$f":"IF($V11<>0, Valsp1003(D11,G11,H11,I11))","v":false},{"$f":"IF($V11<>0, Valsp1004(J11,K11,L11))","v":false},{"$f":"IF($V11<>0, Valsp1005(M11,N11,O11))","v":false},{"$f":"IF($V11<>0, Valsp1011(C11,E11,P11))","v":false},{"$f":"IF($V11<>0, OR(Valsp1012(G11+H11,I11), Valsp1012(J11+K11,L11), Valsp1012(M11+N11,O11)))","v":false},0,{"$f":"IF($V11<>0, Valsp1020(D11,Q11))","v":false},0,{"$f":"IF($V11<>0,Valsp1024(D11,G11,H11,I11))","v":false}]
[null,"Heritage Park School",7040,"Special",null,null,102,102,1020000,0,0,0,0,0,0,1020000,0,null,null,"",null,1,{"$f":"IF($V12<>0,OR(Valsp11(C12),Valsp11(Q12)))","v":false},false,false,{"$f":"IF($V12<>0, Valsp211(C12,0))","v":false},{"$f":"IF($V12<>0, Valsp212(B12, G12+H12+J12+K12+M12+N12))","v":false},{"$f":"IF($V12<>0, Valsp25(C12))","v":false},{"$f":"IF($V12<>0,Valsp2101(F12))","v":false},{"$f":"IF($V12<>0,Valsp291(E12,F12))","v":false},{"$f":"IF($V12<>0, Valsp1002(G12+H12+J12+K12+M12+N12))","v":false},{"$f":"IF($V12<>0, Valsp1003(D12,G12,H12,I12))","v":false},{"$f":"IF($V12<>0, Valsp1004(J12,K12,L12))","v":false},{"$f":"IF($V12<>0, Valsp1005(M12,N12,O12))","v":false},{"$f":"IF($V12<>0, Valsp1011(C12,E12,P12))","v":false},{"$f":"IF($V12<>0, OR(Valsp1012(G12+H12,I12), Valsp1012(J12+K12,L12), Valsp1012(M12+N12,O12)))","v":false},0,{"$f":"IF($V12<>0, Valsp1020(D12,Q12))","v":false},0,{"$f":"IF($V12<>0,Valsp1024(D12,G12,H12,I12))","v":false}]
[null,"Becton School",7038,"HSP",null,null,33,33,330000,0,0,0,42,42,420000,750000,0,null,null,"",null,1,{"$f":"IF($V13<>0,OR(Valsp11(C13),Valsp11(Q13)))","v":false},false,false,{"$f":"IF($V13<>0, Valsp211(C13,0))","v":false},{"$f":"IF($V13<>0, Valsp212(B13, G13+H13+J13+K13+M13+N13))","v":false},{"$f":"IF($V13<>0, Valsp25(C13))","v":false},{"$f":"IF($V13<>0,Valsp2101(F13))","v":false},{"$f":"IF($V13<>0,Valsp291(E13,F13))","v":false},{"$f":"IF($V13<>0, Valsp1002(G13+H13+J13+K13+M13+N13))","v":false},{"$f":"IF($V13<>0, Valsp1003(D13,G13,H13,I13))","v":false},{"$f":"IF($V13<>0, Valsp1004(J13,K13,L13))","v":false},{"$f":"IF($V13<>0, Valsp1005(M13,N13,O13))","v":false},{"$f":"IF($V13<>0, Valsp1011(C13,E13,P13))","v":false},{"$f":"IF($V13<>0, OR(Valsp1012(G13+H13,I13), Valsp1012(J13+K13,L13), Valsp1012(M13+N13,O13)))","v":false},0,{"$f":"IF($V13<>0, Valsp1020(D13,Q13))","v":false},0,{"$f":"IF($V13<>0,Valsp1024(D13,G13,H13,I13))","v":false}]
[null,"Mossbrook School",7036,"Special",null,null,126,136,1318333.33,0,0,0,0,0,0,1318333.33,0,null,null,"1003: You have entered an amount which is outside the expected tolerance. Please check your SEN place funding.\r\n",null,1,{"$f":"IF($V14<>0,OR(Valsp11(C14),Valsp11(Q14)))","v":false},false,false,{"$f":"IF($V14<>0, Valsp211(C14,0))","v":false},{"$f":"IF($V14<>0, Valsp212(B14, G14+H14+J14+K14+M14+N14))","v":false},{"$f":"IF($V14<>0, Valsp25(C14))","v":false},{"$f":"IF($V14<>0,Valsp2101(F14))","v":false},{"$f":"IF($V14<>0,Valsp291(E14,F14))","v":false},{"$f":"IF($V14<>0, Valsp1002(G14+H14+J14+K14+M14+N14))","v":false},{"$f":"IF($V14<>0, Valsp1003(D14,G14,H14,I14))","v":true},{"$f":"IF($V14<>0, Valsp1004(J14,K14,L14))","v":false},{"$f":"IF($V14<>0, Valsp1005(M14,N14,O14))","v":false},{"$f":"IF($V14<>0, Valsp1011(C14,E14,P14))","v":false},{"$f":"IF($V14<>0, OR(Valsp1012(G14+H14,I14), Valsp1012(J14+K14,L14), Valsp1012(M14+N14,O14)))","v":false},0,{"$f":"IF($V14<>0, Valsp1020(D14,Q14))","v":false},0,{"$f":"IF($V14<>0,Valsp1024(D14,G14,H14,I14))","v":false}]
[null,"Woolley Wood School",7026,"Special",null,null,101.5,101.5,1015000,0,0,0,0,0,0,1015000,0,null,null,"",null,1,{"$f":"IF($V15<>0,OR(Valsp11(C15),Valsp11(Q15)))","v":false},false,false,{"$f":"IF($V15<>0, Valsp211(C15,0))","v":false},{"$f":"IF($V15<>0, Valsp212(B15, G15+H15+J15+K15+M15+N15))","v":false},{"$f":"IF($V15<>0, Valsp25(C15))","v":false},{"$f":"IF($V15<>0,Valsp2101(F15))","v":false},{"$f":"IF($V15<>0,Valsp291(E15,F15))","v":false},{"$f":"IF($V15<>0, Valsp1002(G15+H15+J15+K15+M15+N15))","v":false},{"$f":"IF($V15<>0, Valsp1003(D15,G15,H15,I15))","v":false},{"$f":"IF($V15<>0, Valsp1004(J15,K15,L15))","v":false},{"$f":"IF($V15<>0, Valsp1005(M15,N15,O15))","v":false},{"$f":"IF($V15<>0, Valsp1011(C15,E15,P15))","v":false},{"$f":"IF($V15<>0, OR(Valsp1012(G15+H15,I15), Valsp1012(J15+K15,L15), Valsp1012(M15+N15,O15)))","v":false},0,{"$f":"IF($V15<>0, Valsp1020(D15,Q15))","v":false},0,{"$f":"IF($V15<>0,Valsp1024(D15,G15,H15,I15))","v":false}]
{"$rows_left_out":196}
{"sheet":"Early Years Table","index":4,"n_rows":60,"n_cols":32,"rows_kept":60,"cut":false,"hidden":false,"merged":[[4,1,4,17],[6,20,7,20],[12,20,13,20],[6,8,7,8],[6,9,6,11],[6,3,7,3],[6,1,7,2],[6,12,6,14],[12,4,13,4],[12,5,12,7],[12,8,13,8],[12,9,12,14],[13,12,13,14],[12,1,13,2],[12,3,13,3],[6,21,7,21],[12,21,13,21],[45,3,45,14],[33,21,34,21],[26,21,27,21],[42,15,42,17],[45,15,45,17],[12,15,12,18],[6,15,6,18],[6,4,7,4],[6,5,6,7],[33,20,34,20],[33,15,33,18],[33,1,34,2],[33,3,34,14],[21,1,21,2],[26,20,27,20],[26,15,26,18],[26,1,27,2],[26,4,27,4],[26,5,26,7],[26,8,27,8],[27,12,27,14],[26,3,27,3],[21,12,21,14],[26,9,26,11],[59,20,61,20],[42,3,42,14],[54,3,54,14],[50,3,50,14],[45,1,45,2],[55,15,55,17],[59,1,61,2],[59,3,61,18],[54,15,54,17],[51,15,51,17],[50,15,50,17]]}
[]
[null,null,null,null,"LA Name",null,"LA Number"]
[null,null,null,null,{"$f":"IF('Cover Sheet'!C13 = \"\",\"\",'Cover Sheet'!C13)","v":"Sheffield"},null,{"$f":"IF('Cover Sheet'!C15 = \"\",\"\",'Cover Sheet'!C15)","v":373}]
[null,null,null,null,null,null,null,null,null,null,null,null,null,null,null,null,null,null,null,null,null,null,"EYNFF","MNS"]
[null,"Pass-through rate for delivering government funded hours:",null,null,null,null,null,null,null,null,null,null,null,null,null,null,null,null,{"$f":"IF(AND(SUM(Total1a)<>0, $W$5<>0),((SUM(Total1, Total2, Total37a8)-$X$5)/(SUM(Total1a))/$W$5),\"\")","v":0.95849766693690175},null,{"$f":"ValSP1023(S5)","v":{"$error":"#NAME?"}},null,{"$f":"VLOOKUP(G3, PrevYrData, 3, FALSE)","v":4.57},{"$f":"VLOOKUP(G3, PrevYrData, 4, FALSE)","v":26847.759935400005}]
[]
[null,"EYSFF (3 & 4 year olds): \nBase rate",null,null,"Description","Unit Value (£)",null,null,"Unit\nApplied","Number of Units (Universal 15 hours)",null,null,"Number of Units (Additional 15 hours)",null,null,"Anticipated Budget (£)",null,null,null,null,"Error Message(s)"]
[null,null,null,null,null,"PVI","Nursery School","Primary Nursery Class",null,"PVI","Nursery School","Primary Nursery Class","PVI","Nursery School","Primary Nursery Class","PVI","Nursery School","Primary Nursery Class","TOTAL",null,null,null,"HasData","ValSP321","ValSP500","ValSP507","ValSP508","ValSP5010","ValSP5011","ValSP5012","ValSP1009","ValSP1010"]
["EY1","1. Base Rate(s) per hour, per provider type  ",null,1,"EYSFF Base Rate 3&4yo",4.0999999999999996,4.0999999999999996,4.0999999999999996,"PerHour",3642994.1,96526.39,946716.57,1217963.8,16426.169999999998,153422.76999999999,{"$f":"IF(AND(F9=\"\",J9=\"\"),\"\",F9*(J9+M9))","v":19929927.390000001},{"$f":"IF(AND(G9=\"\",L9=\"\"),\"\",G9*(K9+N9))","v":463105.49599999993},{"$f":"IF(AND(H9=\"\",N9=\"\"),\"\",H9*(L9+O9))","v":4510571.2939999988},{"$f":"SUM(P9:R9)","v":24903604.18},null,{"$f":"ValSP_EYErrorMessage(X9,Y9,Z9,AA9,AB9,AC9,AD9,AE9,AF9)","v":""},null,{"$f":"COUNTA(E9:O9) <> 0","v":true},null,{"$f":"OR(ValSP500(F9,J9),ValSP500(G9,K9),ValSP500(H9,L9))","v":false},{"$f":"OR(valsp507(I9,F9),valsp507(I9,G9),valsp507(I9,H9))","v":false},{"$f":"OR(valsp508(I9,F9),valsp508(I9,G9),valsp508(I9,H9))","v":false},{"$f":"AND(W9,OR(ValSP5010(J9),ValSP5010(K9),ValSP5010(L9),ValSP5010(M9),ValSP5010(N9),ValSP5010(O9)))","v":false},{"$f":"OR(valsp5011(I9,F9),valsp5011(I9,G9),valsp5011(I9,H9))","v":false},{"$f":"OR(ValSP5012(I9,J9),ValSP5012(I9,K9),ValSP5012(I9,L9),ValSP5012(I9,M9),ValSP5012(I9,N9),ValSP5012(I9,O9))","v":false},{"$f":"AND(W9,valsp1009(E9))","v":false},{"$f":"AND(LEN(E9)<>0,COUNTA(F9:H9,J9:O9)=0)","v":false}]
[null,null,"End of section 1"]
[]
[]
[null,"EYSFF (3 and 4 year olds):\nOther formula factors - supplements",null,null,"Description","Unit Value (£)",null,null,"Unit\nApplied","Number of Units (Universal & Additional 15 hours)",null,null,null,null,null,"Anticipated Budget (£)",null,null,null,null,"Error Message(s)"]
[null,null,null,null,null,"PVI","Nursery School","Primary Nursery Class",null,"PVI","Nursery School","Primary Nursery Class","Not used",null,null,"PVI","Nursery School","Primary Nursery Class","TOTAL"]
["EY2a",null,"A. Deprivation (Mandatory)",1,"IDACI index based",0.3,0.3,0.3,"PerHour",2106165.17,58406.13,580420.32999999996,null,null,null,{"$f":"IF(AND(F15=\"\",J15=\"\"),\"\",F15*J15)","v":631849.55099999998},{"$f":"IF(AND(G15=\"\",L15=\"\"),\"\",G15*K15)","v":17521.839},{"$f":"IF(AND(H15=\"\",N15=\"\"),\"\",H15*L15)","v":174126.09899999999},{"$f":"SUM(P15:R15)","v":823497.48900000006},null,{"$f":"ValSP_EYErrorMessage(X15,Y15,Z15,AA15,AB15,AC15,AD15,AE15,AF15)","v":""},null,{"$f":"COUNTA(E15:L15) <> 0","v":true},null,{"$f":"OR(ValSP500(F15,J15),ValSP500(G15,K15),ValSP500(H15,L15))","v":false},{"$f":"OR(valsp507(I15,F15),valsp507(I15,G15),valsp507(I15,H15))","v":false},{"$f":"OR(valsp508(I15,F15),valsp508(I15,G15),valsp508(I15,H15))","v":false},{"$f":"AND(W15,OR(ValSP5010(J15),ValSP5010(K15),ValSP5010(L15)))","v":false},{"$f":"OR(valsp5011(I15,F15),valsp5011(I15,G15),valsp5011(I15,H15))","v":false},{"$f":"OR(ValSP5012(I15,J15),ValSP5012(I15,K15),ValSP5012(I15,L15))","v":false},{"$f":"AND(W15,valsp1009(E15))","v":false},{"$f":"AND(LEN(E15)<>0,COUNTA(F15:H15,J15:L15)=0)","v":false}]
{"$rows_left_out":46}
{"sheet":"Admin","index":5,"n_rows":155,"n_cols":18,"rows_kept":155,"cut":false,"hidden":true,"merged":[]}
["1 - EYSFF (3 and 4 year olds) base rate(s) per hour","EY1",null,"LA List","LA NAME","EYNFF","MNS",null,"SchoolState",null,"SchoolType",null,null,"Full LA List"]
["2a - Supplements: deprivation","EY2a",null,201,"City of London",0,0,null,"Closed",null,"HSP",null,null,201,"City of London"]
["2b - Supplements: quality","EY2b",null,202,"Camden",8.51,0,null,"Converter",null,"Mainstream",null,null,420,"Isles of Scilly"]
["2c - Supplements: flexibility","EY2c",null,203,"Greenwich",6.17,703494,null,"Open",null,"PRU",null,null,835,"Dorset (Pre LGR 2019)",null,null,"Not used"]
["2d - Supplements: rurality/sparsity","EY2d",null,204,"Hackney",5.83,442046.39999999997,null,null,null,"Special",null,null,836,"Poole (Pre LGR 2019)",null,null,"Not used"]
["2e - Supplements: EAL","EY2e",null,205,"Hammersmith & Fulham",7.92,808049.1,null,null,null,null,null,null,837,"Bournemouth (Pre LGR 2019)",null,null,"Not used"]
["3 - Maintained nursery school (MNS) lump sums","EY3",null,206,"Islington",7.81,340533.19868520001,null,null,null,null,null,null,202,"Camden",8.51,0]
["4 - Hours above universal/ additional 15 hours","EY4",null,207,"Kensington & Chelsea",7.89,584403.89256719977,null,null,null,null,null,null,203,"Greenwich",6.17,703494]
["5 - EYSFF (2 year olds) base rate(s) per hour","EY5",null,208,"Lambeth",7.32,547088.85000000009,null,null,null,null,null,null,204,"Hackney",5.83,442046.39999999997]
["6a - Quality supplements","EY6a",null,209,"Lewisham",5.62,443642.39999999997,null,null,null,null,null,null,205,"Hammersmith & Fulham",7.92,808049.1]
["6b - Other supplements","EY6b",null,210,"Southwark",6.86,1467949.5,null,null,null,null,null,null,206,"Islington",7.81,340533.19868520001]
["7ai - SEN Inclusion (3 and 4 year olds) funding allocated from EY block","EY7ai",null,211,"Tower Hamlets",8.06,565808.59932359995,null,null,null,null,null,null,207,"Kensington & Chelsea",7.89,584403.89256719977]
["7aii - SEN Inclusion (3 and 4 year olds) funding allocated from HN block","EY7aii",null,212,"Wandsworth",6.48,427260.6,null,null,null,null,null,null,208,"Lambeth",7.32,547088.85000000009]
["7bi - SEN Inclusion (2 year olds) funding allocated from EY block","EY7bi",null,213,"Westminster",7.86,1398591.9,null,null,null,null,null,null,209,"Lewisham",5.62,443642.39999999997]
["7bii - SEN Inclusion (2 year olds) funding allocated from HN block","EY7bii",null,301,"Barking & Dagenham",5.5,0,null,null,null,null,null,null,210,"Southwark",6.86,1467949.5]
{"$rows_left_out":141}
{"sheet":"Prev_LA_Table","index":6,"n_rows":195,"n_cols":10,"rows_kept":195,"cut":false,"hidden":false,"merged":[]}
["LA Table: FUNDING PERIOD (2018-19)"]
["Department for Education Section 251 Financial Data Collection",null,null,null,"LA Table   Local Authority Information"]
[]
["Local Authority ","Sheffield",373]
[]
["Description","EarlyYears","Primary","Secondary","SENSpecial","APPRU","PostSchool","Gross","Income","Net"]
[]
[" 1 SCHOOLS BUDGET"]
[]
["1.0.1 Individual Schools Budget (i.e. school budget shares, before Academy recoupment), including 6th form grant for maintained schools, but excluding all high needs place funding",32843339,176388417,141201635,0,0,null,350433391,null,350433391]
["1.0.2 High needs place funding within Individual Schools Budget (i.e. within school budget shares, before Academy recoupment), including all pre- and post-16 place funding for maintained schools and academies",null,749833,464667,11492917,1420000,null,14127417,null,14127417]
[]
["   DELEGATED ITEMS"]
[]
["1.1.1 Contingencies",null,259289,28539,null,null,null,287828,0,287828]
{"$rows_left_out":180}