{"text_format":"1","workbook":"xlsx","n_sheets":3,"sheets":["Nursery 2","School List","Hinde House"],"not_rendered":{"charts":0,"images":1,"macros":1,"external_links":8,"defined_names":150,"comments":1,"pivot_tables":0},"unopened":[],"bounds":{"document_bytes":16777216,"sheet_cells":100000,"rows_first":2000,"rows_last":500,"rows_between":2000,"halvings":0,"cell_chars":16384,"cell_head_chars":4096},"cells_cut":0,"cells_raw":0,"read":"whole","date_system":"1900"}

{"sheet":"Nursery 2","index":0,"n_rows":64,"n_cols":12,"rows_kept":64,"cut":false,"hidden":false,"merged":[[1,1,2,9],[1,14,2,15]]}
[]
[null,"Maintained Schools - Funded Early Learning - 2 Year Olds\nRevised Indicative Budget - Summer 2020"]
[]
[]
[null,"Provider:"]
[null,1]
[null,"INTEGRA No:",null,{"$f":"VLOOKUP(B6,C46:D64,2,FALSE)","v":"00071002"}]
[]
[]
[]
[null,"Funding Breakdown",null,null,"Hours",null,"£/Hour",null,"Indicative Funding"]
[]
[null,"Spring Term 2020 Adjustment Hours - see the note below.",null,null,{"$f":"VLOOKUP($D$7,[4]Summer!$B:$J,5,FALSE)","v":0},null,null,null,{"$f":"E13*$G$18","v":0}]
[null,"Summer Term 2020 Actual Hours",null,null,{"$f":"VLOOKUP($D$7,[4]Summer!$B:$J,4,FALSE)","v":4194},null,null,null,{"$f":"E14*$G$18","v":21053.879999999997}]
[null,"Autumn Term 2020 Forecast Hours  ",null,null,{"$f":"VLOOKUP($D$7,[4]Summer!$B:$J,6,FALSE)","v":6607},null,null,null,{"$f":"E15*$G$18","v":33167.14}]
[null,"Spring Term 2021 Forecast Hours ",null,null,{"$f":"VLOOKUP($D$7,[4]Summer!$B:$J,8,FALSE)","v":3700},null,null,null,{"$f":"E16*$G$18","v":18574}]
[]
[null,"Total Hours",null,null,{"$f":"SUM(E13:E16)","v":14501},null,5.0199999999999996,null,{"$f":"IF(ISERROR(E18*$G$18),0,E18*$G$18)","v":72795.01999999999}]
[null,null,null,null,{"$f":"VLOOKUP(D7,[4]Summer!$B:$J,9,FALSE)-E18","v":0},null,null,null,{"$f":"VLOOKUP($D$7,[4]Summer!$B:$L,11,FALSE)-I18","v":0}]
[]
[null,"Standard Number of weeks in each term",null,null,null,null,null,null,"Weeks"]
[null,"Summer Term 2020 ",null,null,null,null,null,null,13]
[null,"Autumn Term 2020",null,null,null,null,null,null,14]
[null,"Spring Term 2021",null,null,null,null,null,null,11]
[null,"Total FEL Weeks Funded Annually",null,null,null,null,null,null,{"$f":"SUM(I22:I24)","v":38}]
[]
[]
[null,"Revised Indicative Budget ",null,null,null,null,null,null,{"$f":"VLOOKUP($D$7,[4]Summer!$B:$L,11,FALSE)","v":72795.02},null,null,{"$f":"I18-I28","v":0}]
[null,"Original Indicative Budget 2020-2021:",null,null,null,null,null,null,{"$f":"IF((ISERROR(VLOOKUP($D$7,[4]Summer!$B:$M,12,FALSE))),0, VLOOKUP($D$7,[4]Summer!$B:$M,12,FALSE))","v":76053},null,null,{"$f":"IF((ISERROR(VLOOKUP($D$7,[4]Summer!$B:$M,12,FALSE))),0, VLOOKUP($D$7,[4]Summer!$B:$M,12,FALSE))-I29","v":0}]
[null,"Variance (from the Original Indicative Budget)",null,null,null,null,null,null,{"$f":"I28-I29","v":-3257.9799999999959},null,null,{"$f":"VLOOKUP($D$7,[4]Summer!$B:$N,13,FALSE)-I30","v":0}]
[]
[]
[null,"Please Note: This is the Summer 2020 revised indicative budget produced in July 2020 and it shows the actual hours of "]
[null,"participation for the Summer 2020 term at the fixed hourly funding rate for 2 year olds."]
[null,"The FEL hours claimed are not set to 2 decimal places therefore the funding may show anomolies due to roundings."]
[null,"Variance: Please note that the variance figure shown above is purely the difference from the original indicative budget set "]
[null,"for 2020/21 as compared to the revised indicative forecast budget set after the summer 2020 participation hours are published."]
[null,"FEL Extraordinary Payments - Please note these are not included on this A4 sheet."]
[]
[]
{"$rows_left_out":25}
{"sheet":"School List","index":1,"n_rows":174,"n_cols":25,"rows_kept":174,"cut":false,"hidden":true,"merged":[]}
[null,null,2,null,6,1,null,3,4,5,7,8,9]
["LxSTAB","URN","School_Name","Ref","OEO BU","DfE","Prev DfE","Academy Type ","Phase",null,"Family of Schools"]
[3732001,106982,"Abbey Lane Primary School",null,"72001",2001,null,0,"Primary","Maintained Primary","Meadowhead",null,0,null,3732001,"Abbey Lane Primary School","Maintained Primary","pri",0,null,3732001,"Abbey Lane Primary School","Primary",0,0]
[3732318,107063,"Acres Hill Community Primary School",null,"72318",2318,null,0,"Primary","Maintained Primary","Park Academy",null,0,null,3732318,"Acres Hill Community Primary School","Maintained Primary","pri",0,null,3732318,"Acres Hill","Primary",0,0]
[3732342,107085,"Angram Bank Primary School",null,"72342",2342,null,0,"Primary","Maintained Primary","Ecclesfield",null,0,null,3732342,"Angram Bank Primary School","Maintained Primary","pri",0,null,3732342,"Angram Bank Primary School","Primary",0,0]
[3732343,107086,"Anns Grove Primary School",null,"72343",2343,null,0,"Primary","Maintained Primary","Newfield",null,0,null,3732343,"Anns Grove Primary School","Maintained Primary","pri",0,null,3732343,"Anns Grove Primary School","Primary",0,0]
[3733429,133994,"Arbourthorne Community Primary School",null,"73429",3429,null,0,"Primary","Maintained Primary","Springs Academy",null,0,null,3733429,"Arbourthorne Community Primary School","Maintained Primary","pri",0,null,3733429,"Arbourthorne Community Primary","Primary",0,0]
[3732340,107083,"Athelstan Primary School",null,"72340",2340,null,0,"Primary","Maintained Primary","Handsworth Grange",null,0,null,3732340,"Athelstan Primary School","Maintained Primary","pri",0,null,3732340,"Athelstan Primary School","Primary",0,0]
[3732281,107047,"Ballifield Primary School",null,"72281",2281,null,0,"Primary","Maintained Primary","Handsworth Grange",null,0,null,3732281,"Ballifield Primary School","Maintained Primary","pri",0,null,3732281,"Ballifield Primary","Primary",0,0]
[3732322,107066,"Bankwood Community Primary School",null,"72322",2322,null,0,"Primary","Maintained Primary","Newfield",null,0,null,3732322,"Bankwood Community Primary School","Maintained Primary","pri",0,null,3732322,"Bankwood Primary School","Primary",0,0]
[3732274,107044,"Beck Primary School",null,"72274",2274,null,0,"Primary","Maintained Primary","Firth Park",null,0,null,3732274,"Beck Primary School","Maintained Primary","pri",0,null,3732274,"Beck Primary School","Primary",0,0]
[3732241,107036,"Beighton Nursery and Infant School",null,"72241",2241,null,0,"Primary","Maintained Primary","Westfield",null,0,null,3732241,"Beighton Nursery and Infant School","Maintained Primary","pri",0,null,3732241,"Beighton Nursery and Infants","Primary",0,0]
[3732353,107096,"Birley Community Primary School",null,"72353",2353,null,0,"Primary","Maintained Primary","Birley",null,0,null,3732353,"Birley Community Primary School","Maintained Primary","pri",0,null,3732353,"Birley Primary School","Primary",0,0]
[3732323,107067,"Birley Spa Community Primary School",null,"72323",2323,null,0,"Primary","Maintained Primary","Birley",null,0,null,3732323,"Birley Spa Community Primary School","Maintained Primary","pri",0,null,3732323,"Birley Spa Community Primary","Primary",0,0]
[3732328,107072,"Bradfield Dungworth Primary School",null,"72328",2328,null,0,"Primary","Maintained Primary","Bradfield",null,0,null,3732328,"Bradfield Dungworth Primary School","Maintained Primary","pri",0,null,3732328,"Bradfield Dungworth","Primary",0,0]
[3732233,107033,"Bradway Primary School",null,"72233",2233,null,0,"Primary","Maintained Primary","Meadowhead",null,0,null,3732233,"Bradway Primary School","Maintained Primary","pri",0,null,3732233,"Bradway Primary","Primary",0,0]
[3732014,106987,"Brightside Nursery and Infant School",null,"72014",2014,null,0,"Primary","Maintained Primary","Hinde House",null,0,null,3732014,"Brightside Nursery and Infant School","Maintained Primary","pri",0,null,3732014,"Brightside Nursery Inf School","Primary",0,0]
[3732246,107037,"Brook House Junior School",null,"72246",2246,null,0,"Primary","Maintained Primary","Westfield",null,0,null,3732246,"Brook House Junior School","Maintained Primary","pri",0,null,3732246,"Brook House Junior School","Primary",0,0]
[3735204,107154,"Broomhill Infant School",null,"75204",5204,null,0,"Primary","Maintained Primary","King Edward",null,0,null,3735204,"Broomhill Infant School","Maintained Primary","pri",0,null,3735204,"Broomhill Infant School","Primary",0,0]
[3732325,107069,"Brunswick Community Primary School",null,"72325",2325,null,0,"Primary","Maintained Primary","Handsworth Grange",null,0,null,3732325,"Brunswick Community Primary School","Maintained Primary","pri",0,null,3732325,"Brunswick Community Primary","Primary",0,0]
[3732095,107008,"Byron Wood Primary School",null,"72095",2095,null,0,"Primary","Maintained Primary","Fir Vale",null,0,null,3732095,"Byron Wood Primary School","Maintained Primary","pri",0,null,3732095,"Byron Wood","Primary",0,0]
[3732344,107087,"Carfield Primary School",null,"72344",2344,null,0,"Primary","Maintained Primary","Newfield",null,0,null,3732344,"Carfield Primary School","Maintained Primary","pri",0,null,3732344,"Carfield Primary School","Primary",0,0]
[3732023,106988,"Carter Knowle Junior School",null,"72023",2023,null,0,"Primary","Maintained Primary","King Ecgbert",null,0,null,3732023,"Carter Knowle Junior School","Maintained Primary","pri",0,null,3732023,"Carter Knowle Junior","Primary",0,0]
[3732354,107097,"Charnock Hall Primary School",null,"72354",2354,null,0,"Primary","Maintained Primary","Birley",null,0,null,3732354,"Charnock Hall Primary School","Maintained Primary","pri",0,null,3732354,"Charnock Hall Primary School","Primary",0,0]
[3735200,107150,"Clifford CofE Infant School",null,"75200",5200,null,0,"Primary","Maintained Primary","King Edward",null,0,null,3735200,"Clifford CofE Infant School","Maintained Primary","pri",0,null,3735200,"Clifford C of E Infant School","Primary",0,0]
[3732312,107060,"Coit Primary School",null,"72312",2312,null,0,"Primary","Maintained Primary","Ecclesfield",null,0,null,3732312,"Coit Primary School","Maintained Primary","pri",0,null,3732312,"Coit Primary","Primary",0,0]
[3732026,107041,"Concord Junior School",null,"62026",2026,2263,"Recoupment Academy","Primary","Mainstream Academy","Hinde House",null,2263,null,3732026,"Concord Junior School","Mainstream Academy","pri",0,null,3732026,"Concord Junior School","Primary","Recoupment Academy",0]
[3733422,107117,"Deepcar St John's Church of England Junior School",null,"73422",3422,null,0,"Primary","Maintained Primary","Stocksbridge",null,0,null,3733422,"Deepcar St John's Church of England Junior School","Maintained Primary","pri",0,null,3733422,"Deepcar St John's C E Jnr Sch","Primary",0,0]
[3732283,107048,"Dobcroft Infant School",null,"72283",2283,null,0,"Primary","Maintained Primary","Silverdale",null,0,null,3732283,"Dobcroft Infant School","Maintained Primary","pri",0,null,3732283,"Dobcroft Infant School","Primary",0,0]
[3732239,107035,"Dobcroft Junior School",null,"72239",2239,null,0,"Primary","Maintained Primary","Silverdale",null,0,null,3732239,"Dobcroft Junior School","Maintained Primary","pri",0,null,3732239,"Dobcroft Junior School","Primary",0,0]
[3732364,132152,"Dore Primary School",null,"72364",2364,null,0,"Primary","Maintained Primary","King Ecgbert",null,0,null,3732364,"Dore Primary School","Maintained Primary","pri",0,null,3732364,"Dore Primary School","Primary",0,0]
[3733008,107105,"Ecclesall Church of England Junior School",null,"73008",3008,null,0,"Primary","Maintained Primary","High Storrs",null,0,null,3733008,"Ecclesall Church of England Junior School","Maintained Primary","pri",0,null,3733008,"Ecclesall CE Junior School","Primary",0,0]
[3732206,107025,"Ecclesall Infant School",null,"72206",2206,null,0,"Primary","Maintained Primary","High Storrs",null,0,null,3732206,"Ecclesall Infant School","Maintained Primary","pri",0,null,3732206,"Ecclesall Infant School","Primary",0,0]
[3732080,107001,"Ecclesfield Primary School",null,"72080",2080,null,0,"Primary","Maintained Primary","Ecclesfield",null,0,null,3732080,"Ecclesfield Primary School","Maintained Primary","pri",0,null,3732080,"Ecclesfield Primary School","Primary",0,0]
[3733426,107120,"Emmanuel Anglican/Methodist Junior School",null,"73426",3426,null,0,"Primary","Maintained Primary","Westfield",null,0,null,3733426,"Emmanuel Anglican/Methodist Junior School","Maintained Primary","pri",0,null,3733426,"Emmanuel Junior School (Anglican Methodist Aided)","Primary",0,0]
[3732028,134231,"Emmaus Catholic and CofE Primary School",null,"62028",2028,3430,"Recoupment Academy","Primary","Mainstream Academy","Park Academy",null,3430,null,3732028,"Emmaus Catholic and CofE Primary School","Mainstream Academy","pri",0,null,3732028,"Emmaus Catholic and Church of England Primary School","Primary","Recoupment Academy",0]
[3732365,133325,"Firs Hill Community Primary School",null,"72365",2365,null,0,"Primary","Maintained Primary","Fir Vale",null,0,null,3732365,"Firs Hill Community Primary School","Maintained Primary","pri",0,null,3732365,"Firs Hill Community Primary","Primary",0,0]
[3732010,139134,"Fox Hill Primary",null,"62010",2010,2330,"Recoupment Academy","Primary","Mainstream Academy","Yewlands",null,2330,null,3732010,"Fox Hill Primary","Mainstream Academy","pri",0,null,3732010,"Fox Hill Primary School","Primary","Recoupment Academy",0]
[3732036,106991,"Gleadless Primary School",null,"72036",2036,null,0,"Primary","Maintained Primary","Birley",null,0,null,3732036,"Gleadless Primary School","Maintained Primary","pri",0,null,3732036,"Gleadless Primary School","Primary",0,0]
[3732305,139297,"Greengate Lane Academy",null,"62305",2305,null,"Recoupment Academy","Primary","Mainstream Academy","Ecclesfield",null,0,null,3732305,"Greengate Lane Academy","Mainstream Academy","pri",0,null,3732305,"Greengate Lane Academy","Primary","Recoupment Academy",0]
{"$rows_left_out":135}
{"sheet":"Hinde House","index":2,"n_rows":89,"n_cols":15,"rows_kept":89,"cut":false,"hidden":true,"merged":[[22,1,22,3],[67,3,67,4],[69,5,69,6],[71,5,71,6],[0,13,1,14],[5,5,5,6],[5,7,5,8],[13,5,13,6],[13,7,13,8],[21,1,21,3]]}
[null,"Maintained Secondary School Revenue Funding Analysis 2016-17",null,null,null,null,null,null,null,null,null,null,null,"Back to Main Menu"]
[]
[null,"Hinde House 3-16"]
[null,{"$error":"#N/A"}]
[null,null,null,null,null,4225,4225]
[null,"Pupil Numbers",null,null,null,"Funded FTEs",null,"Change"]
[null,null,null,null,null,"2015-16","2016-17","FTEs","%  "]
[null,"Nursery 2 YO (Estimated Hours converted to FTE)",null,null,null,{"$f":"G8","v":8.2048872180451138},{"$f":"IF(ISERROR(VLOOKUP($F$5,'[5]EY1516 Smr'!$F:$R,7,FALSE)/38/15/2),0,VLOOKUP($F$5,'[5]EY1516 Smr'!$F:$R,7,FALSE)/38/15/2)","v":8.2048872180451138}]
[null,"Nursery 3 & 4 YO (Estimated Hours converted to FTE)",null,null,null,{"$f":"G9","v":28.046428571428574},{"$f":"IF(ISERROR(VLOOKUP(F5,'[6]EY1516 Aut15'!$G:$S,7,FALSE)/38/15/2),0,VLOOKUP(F5,'[6]EY1516 Aut15'!$G:$S,7,FALSE)/38/15/2)","v":28.046428571428574},{"$f":"G9-F9","v":0},{"$f":"IF(ISERROR(G9/#REF!),0,G9/#REF!)*100","v":0}]
["Cash","Reception - Year 11 (excluding IR Pupils)",null,null,null,{"$f":"VLOOKUP($F$5,[7]MFG!$C:$G,3,FALSE)","v":1231},{"$f":"VLOOKUP($F$5,[7]MFG!$C:$G,4,FALSE)","v":1233},{"$f":"G10-F10","v":2},{"$f":"(H10/F10)*100","v":0.16246953696181965}]
[null,"Reception Uplift arrears (pupils arriving between Oct 13 & Jan 14)",null,null,null,{"$f":"VLOOKUP(F5,[7]Pupils!$D:$L,8,FALSE)","v":0},{"$f":"VLOOKUP($F$5,[7]Pupils!$D:$P,12,FALSE)","v":0},{"$f":"G11-F11","v":0},"n/a"]
[null,"IR Pupils removed",null,null,null,{"$f":"-VLOOKUP($G$5,[7]Pupils!$D:$P,7,FALSE)","v":0},{"$f":"-VLOOKUP($G$5,[7]Pupils!$D:$P,11,FALSE)","v":0},0,"n/a"]
["Advance","Total Pupil Numbers",null,null,null,{"$f":"SUM(F8:F12)","v":1267.2513157894737},{"$f":"SUM(G8:G12)","v":1269.2513157894737},{"$f":"G13-F13","v":2},{"$f":"(H13/F13)*100","v":0.15782189176533132}]
["Budget",null,null,null,null,"Budget",null,"Change"]
["Ref. No.","Budget Allocations","Unit ","Unit Value","£/pupil","2015-16","2016-17","£   ","%  "]
[]
[]
[null,"Basic £/pupil Entitlement","Primary",{"$f":"G10-D20-D19","v":399},{"$f":"#REF!","v":{"$error":"#REF!"}},{"$f":"VLOOKUP(F$5,'[8]with MFG '!$E:$U,L18,FALSE)","v":4137423.5787213314},{"$f":"VLOOKUP($F$5,'[7]with MFG'!$D:$U,L18,FALSE)","v":4181808.9408594724},{"$f":"G18-F18","v":44385.362138140947},{"$f":"IF(M18=TRUE,\"n/a\",IF(F18=0,\"n/a\",(H18/F18)*100))","v":{"$error":"#REF!"}},null,{"$f":"D18*E18","v":{"$error":"#REF!"}},4,{"$f":"SUM(K18:K20)-G18","v":{"$error":"#REF!"}}]
[null,null,"KS3",{"$f":"VLOOKUP($G$5,[7]AWPUs!$A:$F,4,FALSE)","v":508},{"$f":"#REF!","v":{"$error":"#REF!"}},null,null,null,null,null,{"$f":"D19*E19","v":{"$error":"#REF!"}}]
[null,null,"KS4",{"$f":"VLOOKUP($G$5,[7]AWPUs!$A:$F,5,FALSE)","v":326},{"$f":"#REF!","v":{"$error":"#REF!"}},null,null,null,null,null,{"$f":"D20*E20","v":{"$error":"#REF!"}}]
[]
[null,"Additional Delegation (included above)",null,null,{"$f":"VLOOKUP($F$5,'[7]Add Deleg'!$C:$H,5,FALSE)+VLOOKUP($G$5,'[7]Add Deleg'!$C:$H,5,FALSE)","v":195916.01999999996}]
[null,"Of which is de-delegated",null,null,{"$f":"-VLOOKUP($F$5,'[7]Add Deleg'!$C:$H,6,FALSE)-VLOOKUP($G$5,'[7]Add Deleg'!$C:$H,6,FALSE)","v":-85660.5}]
[]
[null,"Social Deprivation - Primary","FSM",{"$f":"[7]FSM!$G$188","v":157},{"$f":"#REF!","v":{"$error":"#REF!"}},{"$f":"'[8]with MFG '!$I$187","v":213128.1300620127},{"$f":"'[7]with MFG'!$H$186","v":220805.70892304246},{"$f":"G25-F25","v":7677.5788610297604},{"$f":"IF(M25=TRUE,\"n/a\",IF(F25=0,\"n/a\",(H25/F25)*100))","v":3.6023301376481172},null,{"$f":"D25*E25","v":{"$error":"#REF!"}},5]
[null,"(IDACI - Income Deprivation Affecting","IDACI Band 1",{"$f":"VLOOKUP($F$5,'[7]IDACI '!$B$38:$W$206,15,FALSE)","v":38.999999999999986},{"$f":"#REF!","v":{"$error":"#REF!"}},null,null,null,null,null,{"$error":"#REF!"}]
[null,"Children Index)","IDACI Band 2",{"$f":"VLOOKUP($F$5,'[7]IDACI '!$B$38:$W$206,16,FALSE)","v":6.9999999999999964},{"$f":"#REF!","v":{"$error":"#REF!"}},null,null,null,null,null,{"$error":"#REF!"}]
[null,null,"IDACI Band 3",{"$f":"VLOOKUP($F$5,'[7]IDACI '!$B$38:$W$206,17,FALSE)","v":100.9999999999998},{"$f":"#REF!","v":{"$error":"#REF!"}},null,null,null,null,null,{"$error":"#REF!"}]
[null,null,"IDACI Band 4",{"$f":"VLOOKUP($F$5,'[7]IDACI '!$B$38:$W$206,18,FALSE)","v":242.99999999999983},{"$f":"#REF!","v":{"$error":"#REF!"}},null,null,null,null,null,{"$error":"#REF!"}]
[null,null,"IDACI Band 5",{"$f":"VLOOKUP($F$5,'[7]IDACI '!$B$38:$W$206,19,FALSE)","v":0},{"$f":"#REF!","v":{"$error":"#REF!"}},null,null,null,null,null,{"$error":"#REF!"}]
[null,null,"IDACI Band 6",{"$f":"VLOOKUP($F$5,'[7]IDACI '!$B$38:$W$206,20,FALSE)","v":0.99999999999999956},{"$f":"#REF!","v":{"$error":"#REF!"}},null,null,null,null,null,{"$error":"#REF!"},null,{"$f":"SUM(K25:K31)-G25","v":{"$error":"#REF!"}}]
[]
[null,"Social Deprivation - Secondary","FSM",{"$f":"[7]FSM!$G$189","v":241.99999999999997},{"$f":"#REF!","v":{"$error":"#REF!"}},{"$f":"'[8]with MFG '!$I$188","v":509504.65082628379},{"$f":"'[7]with MFG'!$H$187","v":465733.34427349479},{"$f":"G33-F33","v":-43771.306552788999},{"$f":"IF(M33=TRUE,\"n/a\",IF(F33=0,\"n/a\",(H33/F33)*100))","v":-8.5909532880226589},null,{"$f":"D33*E33","v":{"$error":"#REF!"}},5]
[null,null,"IDACI Band 1",{"$f":"VLOOKUP($G$5,'[7]IDACI '!$B$178:$W$204,15,FALSE)","v":134.16086434573802},{"$f":"#REF!","v":{"$error":"#REF!"}},null,null,null,null,null,{"$error":"#REF!"}]
[null,null,"IDACI Band 2",{"$f":"VLOOKUP($G$5,'[7]IDACI '!$B$178:$W$204,16,FALSE)","v":115.13805522208922},{"$f":"#REF!","v":{"$error":"#REF!"}},null,null,null,null,null,{"$error":"#REF!"}]
[null,null,"IDACI Band 3",{"$f":"VLOOKUP($G$5,'[7]IDACI '!$B$178:$W$204,17,FALSE)","v":288.34573829531791},{"$f":"#REF!","v":{"$error":"#REF!"}},null,null,null,null,null,{"$error":"#REF!"}]
[null,null,"IDACI Band 4",{"$f":"VLOOKUP($G$5,'[7]IDACI '!$B$178:$W$204,18,FALSE)","v":219.2629051620649},{"$f":"#REF!","v":{"$error":"#REF!"}},null,null,null,null,null,{"$error":"#REF!"}]
[null,null,"IDACI Band 5",{"$f":"VLOOKUP($G$5,'[7]IDACI '!$B$178:$W$204,19,FALSE)","v":1.0012004801920762},{"$f":"#REF!","v":{"$error":"#REF!"}},null,null,null,null,null,{"$error":"#REF!"}]
[null,null,"IDACI Band 6",{"$f":"VLOOKUP($G$5,'[7]IDACI '!$B$178:$W$204,20,FALSE)","v":7.0084033613445333},{"$f":"#REF!","v":{"$error":"#REF!"}},null,null,null,null,null,{"$error":"#REF!"},null,{"$f":"SUM(K33:K39)-G33","v":{"$error":"#REF!"}}]
[]
{"$rows_left_out":49}