{"text_format":"1","workbook":"xlsx","n_sheets":3,"sheets":["3&4","Nursery 3&4 Maintained","School List"],"not_rendered":{"charts":0,"images":1,"macros":1,"external_links":8,"defined_names":149,"comments":2,"pivot_tables":0},"unopened":[],"bounds":{"document_bytes":16777216,"sheet_cells":100000,"rows_first":2000,"rows_last":500,"rows_between":2000,"halvings":0,"cell_chars":16384,"cell_head_chars":4096},"cells_cut":0,"cells_raw":0,"read":"whole","date_system":"1900"}

{"sheet":"3&4","index":0,"n_rows":96,"n_cols":17,"rows_kept":96,"cut":false,"hidden":false,"merged":[[33,1,33,3],[1,1,2,9],[1,11,2,12],[26,1,26,3],[16,1,16,3],[17,1,17,3],[18,1,18,3]]}
[]
[null,"Funded Early Learning - 3 & 4 Year Olds - Maintained Schools\nAutumn 2024 - Revised Indicative Budget "]
[]
[]
[null,"Provider::"]
[null,1]
[null,"INTEGRA No:",null,{"$f":"VLOOKUP(B6,C69:D434,2,FALSE)","v":"0047234000"}]
[]
[null,"Funding Rate per pupil hour £"]
[null,"Base Rate Funding per Pupil £ (as at 1/4/24)",null,null,null,null,null,null,5.0599999999999996]
[null,"Deprivation Hourly Base Rate £",null,null,null,null,null,null,{"$f":"VLOOKUP($D$7,'[4]Autumn 24'!$B:$L,11,FALSE)-I10","v":0.3100000000000005},null,null,null,null,null,null,"Internal checks"]
[null,"FEL Funding Hourly Rate (1/4/24 to 31/8/24)",null,null,null,null,null,null,{"$f":"VLOOKUP(D7,'[5]Summer 24'!$B:$L,11,FALSE)","v":5.37},null,null,null,null,null,{"$f":"VLOOKUP($D$7,'[4]Autumn 24'!$B:$L,11,FALSE)-I12","v":0},{"$f":"VLOOKUP($D$7,'[6]2022 23'!$B:$L,11,FALSE)-I12","v":-0.62000000000000011},"Check the Provider FEL rate"]
[]
[null,"Increased FEL Hourly Rate including EYBG* (payable from 1/9/24 to 31/3/25) ",null,null,null,null,null,null,{"$f":"VLOOKUP($D$7,'[4]Autumn 24'!$B:$M,12,FALSE)","v":5.48},null,null,null,null,null,{"$f":"VLOOKUP($D$7,'[4]Autumn 24'!$B:$M,12,FALSE)-I14","v":0}]
[]
[null,"Funding Breakdown",null,null,"Hours",null,"£/Hour",null,"Indicative Funding £"]
[null,"Summer Term 2024 ACTUAL Universal Hours",null,null,{"$f":"ROUND(VLOOKUP($D$7,'[4]Autumn 24'!$B:$K,4,FALSE),0)","v":5850},null,{"$f":"I12","v":5.37},null,{"$f":"E17*G17","v":31414.5}]
[null,"Autumn Term 2024 ACTUAL Universal Hours",null,null,{"$f":"ROUND(VLOOKUP($D$7,'[4]Autumn 24'!$B:$K,6,FALSE),0)","v":3675},null,{"$f":"I14","v":5.48},null,{"$f":"E18*G18","v":20139}]
[null,"Spring Term 2025 Forecast Universal Hours",null,null,{"$f":"ROUND(VLOOKUP($D$7,'[4]Autumn 24'!$B:$K,8,FALSE),0)","v":5370},null,{"$f":"I14","v":5.48},null,29427.600000000002,null,null,null,null,null,null,{"$f":"VLOOKUP($D$7,'[6]2022 23'!$B:$K,10,FALSE)-E25","v":-7110},"Check total forecast FEL hours"]
[]
[null,"Summer Term 2024 ACTUAL EFE Hours",null,null,{"$f":"ROUND(VLOOKUP($D$7,'[4]Autumn 24'!$B:$L,5,FALSE),0)","v":2730},null,{"$f":"I12","v":5.37},null,14660.1,null,null,null,null,null,null,{"$f":"I12-G25","v":5.37},"Check FEL rate"]
[null,"Autumn Term 2024 ACTUAL EFE Hours",null,null,{"$f":"ROUND(VLOOKUP($D$7,'[4]Autumn 24'!$B:$K,7,FALSE),0)","v":1785},null,{"$f":"I14","v":5.48},null,9781.8000000000011,null,null,null,null,null,null,{"$f":"E25*G25-I25","v":-120794.40000000002},"Check revised ind budget"]
[null,"Spring Term 2025 Forecast EFE Hours",null,null,{"$f":"ROUND(VLOOKUP($D$7,'[4]Autumn 24'!$B:$K,9,FALSE),0)","v":2805},null,{"$f":"I14","v":5.48},null,15371.400000000001]
[]
[null,"Funding Based on Indicative Hours:",null,null,{"$f":"SUM(E17:E23)","v":22215},null,null,null,{"$f":"SUM(I17:I23)","v":120794.40000000002}]
[null,null,null,null,{"$f":"VLOOKUP($D$7,'[4]Autumn 24'!$B:$N,10,FALSE)-E25","v":0},null,null,null,{"$f":"VLOOKUP($D$7,'[4]Autumn 24'!$B:$N,13,FALSE)-I25","v":0}]
[null,"Early Years Pupil Premium (EYPP) Funding Breakdown (payable on universal hours only)",null,null,"Hours",null,"£/Hour",null,"Indicative Funding £"]
[null,"Summer Term 2024 EYPP ACTUAL",null,null,{"$f":"VLOOKUP($D$7,'[4]Autumn 24'!$B:$AG,22,FALSE)","v":3315},null,0.68,null,{"$f":"E28*G28","v":2254.2000000000003},null,null,null,null,null,{"$f":"VLOOKUP($D$7,'[4]Autumn 24'!$B:$AG,23,FALSE)-I28","v":0},{"$f":"VLOOKUP($D$7,'[6]2022 23'!$B:$AF,21,FALSE)-E32","v":-2640},"Check total forecast EYPP hours"]
[null,"Autumn Term 2024 EYPP ACTUAL ",null,null,{"$f":"VLOOKUP($D$7,'[4]Autumn 24'!$B:$AX,39,FALSE)","v":1470},null,0.68,null,{"$f":"E29*G29","v":999.6},null,null,null,null,null,{"$f":"VLOOKUP($D$7,'[4]Autumn 24'!$B:$AX,40,FALSE)-I29","v":0}]
[null,"Spring Term 2025 EYPP Forecast ",null,null,0,null,0.68,null,0]
[null,null,null,null,null,null,null,null,null,null,null,null,null,null,null,{"$f":"#REF!*#REF!-#REF!","v":{"$error":"#REF!"}},"Check revised ind budget EYPP"]
[null,"Indicative Funding for Early Years Pupil Premium:",null,null,{"$f":"SUM(E28:E30)","v":4785},null,null,null,{"$f":"SUM(I28:I30)","v":3253.8},null,null,null,null,null,{"$f":"E32*G30-I32","v":0}]
[]
[null,"Disability Access Funding Breakdown:",null,null,"Pupils",null,"£/Annual",null,"DA Funding"]
[null,"Summer Term 2024 Actual",null,null,{"$f":"IFERROR(VLOOKUP($D$7,'[4]Autumn 24'!$B:$AG,24,FALSE),0)","v":0},null,910,null,{"$f":"E35*G35","v":0},null,null,null,null,null,{"$f":"IFERROR(VLOOKUP($D$7,'[4]Autumn 24'!$B:$AG,25,FALSE),0)-I35","v":0},{"$f":"VLOOKUP($D$7,'[6]2022 23'!$B:$AF,23,FALSE)","v":0},"Check total forecast DAF hours"]
[null,"Autumn Term 2024 ACTUAL ",null,null,{"$f":"IFERROR(VLOOKUP($D$7,'[4]Autumn 24'!$B:$AX,41,FALSE),0)","v":0},null,910,null,{"$f":"E36*G36","v":0},null,null,null,null,null,{"$f":"IFERROR(VLOOKUP($D$7,'[4]Autumn 24'!$B:$AX,42,FALSE),0)-I36","v":0}]
[null,"Spring Term 2025 Forecast",null,null,0,null,910,null,{"$f":"E37*G37","v":0}]
[null,null,null,null,null,null,null,null,null,null,null,null,null,null,null,{"$f":"E39*G39-I39","v":0},"Check revised ind budget DAF"]
[null,"Total Disability Access Funding to date",null,null,{"$f":"SUM(E35:E37)","v":0},null,null,null,{"$f":"SUM(I35:I37)","v":0},null,null,null,null,null,{"$f":"E39*G37-I39","v":0}]
[]
{"$rows_left_out":57}
{"sheet":"Nursery 3&4 Maintained","index":1,"n_rows":96,"n_cols":14,"rows_kept":96,"cut":false,"hidden":true,"merged":[[1,1,2,9],[1,11,2,12],[24,1,24,3]]}
[]
[null,"Nursery Free Entitlement Funding 3 & 4 Year Olds\nIndicative Budget 2018-19"]
[]
[]
[null,"Provider::"]
[null,40]
[null,"INTEGRA No:",null,{"$f":"VLOOKUP(B6,C57:D96,2,FALSE)","v":"00072327"}]
[]
[]
[null,"Funding Rate per pupil hour £"]
[null,"Base Rate Funding per Pupil £",null,null,null,null,null,null,4.07]
[null,"Deprivation Hourly Base Rate £",null,null,null,null,null,null,{"$f":"VLOOKUP($D$7,'[7]1819'!$C:$AB,25,FALSE)","v":105569.7}]
[null,"2018/19 Hourly FEL Rate",null,null,null,null,null,null,{"$f":"VLOOKUP($D$7,'[7]1819'!$C:$AL,36,FALSE)","v":120515.84199999999},null,null,{"$f":"VLOOKUP($D$7,'[8]Budget Build'!$C:$AL,35,FALSE)-I13","v":{"$error":"#N/A"}}]
[null,null,null,null,null,null,null,null,{"$f":"SUM(I11:I12)-I13","v":-14942.071999999986}]
[]
[null,"Funding Breakdown",null,null,"Hours",null,"£/Hour",null,"Indicative Funding £"]
[]
[null,"Summer Term (2018) Forecast",null,null,{"$f":"VLOOKUP($D$7,'[7]1819'!$C:$T,15,FALSE)","v":0}]
[null,"Autumn Term (2018) Forecast",null,null,{"$f":"VLOOKUP($D$7,'[7]1819'!$C:$T,16,FALSE)","v":11067}]
[null,"Spring Term (2019) Forecast",null,null,{"$f":"VLOOKUP($D$7,'[7]1819'!$C:$T,17,FALSE)","v":7086.8}]
[]
[null,"Funding Based on Indicative Hours:",null,null,{"$f":"SUM(E18:E21)","v":18153.8},null,{"$f":"I22/E22","v":0.41596635415174787},null,{"$f":"VLOOKUP($D$7,'[7]1819'!$C:$AC,27,FALSE)","v":7551.37},null,null,{"$f":"E22*G22-I22","v":0},null,"`"]
[null,null,null,null,{"$f":"VLOOKUP($D$7,'[7]1819'!$C:$T,18,FALSE)-E22","v":-10369.099999999999},null,null,null,{"$f":"E22*G22-I22","v":0}]
[]
[null,"Early Years Pupil Premium (EYPP) Funding Breakdown",null,null,"Hours",null,"£/Hour",null,"Indicative Funding £"]
[]
[null,"Summer Term (2018) EYPP Forecast",null,null,{"$f":"VLOOKUP($D$7,'[7]1819'!$C:$AH,28,FALSE)","v":113121.06999999999}]
[null,"Autumn Term (2018) EYPP Forecast",null,null,{"$f":"VLOOKUP($D$7,'[7]1819'!$C:$AH,29,FALSE)","v":5913}]
[null,"Spring Term (2019) EYPP Forecast",null,null,{"$f":"VLOOKUP($D$7,'[7]1819'!$C:$AH,30,FALSE)","v":3082.7999999999997}]
[]
[null,"Funding for Early Years Pupil Premium:",null,null,{"$f":"SUM(E27:E29)","v":122116.87},null,0.53,null,{"$f":"IF(ISERROR(E31*G31),2,E31*G31)","v":64721.941100000004}]
[null,null,null,null,null,null,null,null,{"$f":"VLOOKUP($D$7,'[7]1819'!$C:$AH,32,FALSE)-I31","v":-50769.541100000002}]
[]
[null,"Indicative Funding consists of:"]
[null,"Base Funding at £4.07 per hour",null,null,null,null,null,null,{"$f":"VLOOKUP($D$7,'[7]1819'!$C:$AB,24,FALSE)","v":0},null,null,{"$f":"E22*I11-I35","v":73885.966}]
[null,"Deprivation Funding at £0.30 per hour",null,null,null,null,null,null,{"$f":"VLOOKUP($D$7,'[7]1819'!$C:$AB,26,FALSE)","v":0.28999999999999998},null,null,{"$f":"E22*I12-I36","v":1916491219.5699999}]
[null,"EYPP Funding at £0.53 per hour",null,null,null,null,null,null,{"$f":"VLOOKUP($D$7,'[7]1819'!$C:$AH,32,FALSE)","v":13952.4},null,null,{"$f":"E31*G31-I37","v":50769.541100000002}]
[null,"Maintained Nursery School Supplement",null,null,null,null,null,null,{"$f":"VLOOKUP($D$7,'[7]1819'!$C:$AJ,34,FALSE)","v":120515.84199999999}]
[null,"Total Indicative Budget 2018/19",null,null,null,null,null,null,{"$f":"VLOOKUP($D$7,'[7]1819'!$C:$AK,35,FALSE)","v":0},null,null,{"$f":"E22*G22+E31*G31-I39","v":72273.311100000006}]
[null,null,null,null,null,null,null,null,{"$f":"SUM(I35:I38)-I39","v":134468.53199999998}]
{"$rows_left_out":57}
{"sheet":"School List","index":2,"n_rows":174,"n_cols":25,"rows_kept":174,"cut":false,"hidden":true,"merged":[]}
[null,null,2,null,6,1,null,3,4,5,7,8,9]
["LxSTAB","URN","School_Name","Ref","OEO BU","DfE","Prev DfE","Academy Type ","Phase",null,"Family of Schools"]
[3732001,106982,"Abbey Lane Primary School",null,"72001",2001,null,0,"Primary","Maintained Primary","Meadowhead",null,0,null,3732001,"Abbey Lane Primary School","Maintained Primary","pri",0,null,3732001,"Abbey Lane Primary School","Primary",0,0]
[3732318,107063,"Acres Hill Community Primary School",null,"72318",2318,null,0,"Primary","Maintained Primary","Park Academy",null,0,null,3732318,"Acres Hill Community Primary School","Maintained Primary","pri",0,null,3732318,"Acres Hill","Primary",0,0]
[3732342,107085,"Angram Bank Primary School",null,"72342",2342,null,0,"Primary","Maintained Primary","Ecclesfield",null,0,null,3732342,"Angram Bank Primary School","Maintained Primary","pri",0,null,3732342,"Angram Bank Primary School","Primary",0,0]
[3732343,107086,"Anns Grove Primary School",null,"72343",2343,null,0,"Primary","Maintained Primary","Newfield",null,0,null,3732343,"Anns Grove Primary School","Maintained Primary","pri",0,null,3732343,"Anns Grove Primary School","Primary",0,0]
[3733429,133994,"Arbourthorne Community Primary School",null,"73429",3429,null,0,"Primary","Maintained Primary","Springs Academy",null,0,null,3733429,"Arbourthorne Community Primary School","Maintained Primary","pri",0,null,3733429,"Arbourthorne Community Primary","Primary",0,0]
[3732340,107083,"Athelstan Primary School",null,"72340",2340,null,0,"Primary","Maintained Primary","Handsworth Grange",null,0,null,3732340,"Athelstan Primary School","Maintained Primary","pri",0,null,3732340,"Athelstan Primary School","Primary",0,0]
[3732281,107047,"Ballifield Primary School",null,"72281",2281,null,0,"Primary","Maintained Primary","Handsworth Grange",null,0,null,3732281,"Ballifield Primary School","Maintained Primary","pri",0,null,3732281,"Ballifield Primary","Primary",0,0]
[3732322,107066,"Bankwood Community Primary School",null,"72322",2322,null,0,"Primary","Maintained Primary","Newfield",null,0,null,3732322,"Bankwood Community Primary School","Maintained Primary","pri",0,null,3732322,"Bankwood Primary School","Primary",0,0]
[3732274,107044,"Beck Primary School",null,"72274",2274,null,0,"Primary","Maintained Primary","Firth Park",null,0,null,3732274,"Beck Primary School","Maintained Primary","pri",0,null,3732274,"Beck Primary School","Primary",0,0]
[3732241,107036,"Beighton Nursery and Infant School",null,"72241",2241,null,0,"Primary","Maintained Primary","Westfield",null,0,null,3732241,"Beighton Nursery and Infant School","Maintained Primary","pri",0,null,3732241,"Beighton Nursery and Infants","Primary",0,0]
[3732353,107096,"Birley Community Primary School",null,"72353",2353,null,0,"Primary","Maintained Primary","Birley",null,0,null,3732353,"Birley Community Primary School","Maintained Primary","pri",0,null,3732353,"Birley Primary School","Primary",0,0]
[3732323,107067,"Birley Spa Community Primary School",null,"72323",2323,null,0,"Primary","Maintained Primary","Birley",null,0,null,3732323,"Birley Spa Community Primary School","Maintained Primary","pri",0,null,3732323,"Birley Spa Community Primary","Primary",0,0]
[3732328,107072,"Bradfield Dungworth Primary School",null,"72328",2328,null,0,"Primary","Maintained Primary","Bradfield",null,0,null,3732328,"Bradfield Dungworth Primary School","Maintained Primary","pri",0,null,3732328,"Bradfield Dungworth","Primary",0,0]
[3732233,107033,"Bradway Primary School",null,"72233",2233,null,0,"Primary","Maintained Primary","Meadowhead",null,0,null,3732233,"Bradway Primary School","Maintained Primary","pri",0,null,3732233,"Bradway Primary","Primary",0,0]
[3732014,106987,"Brightside Nursery and Infant School",null,"72014",2014,null,0,"Primary","Maintained Primary","Hinde House",null,0,null,3732014,"Brightside Nursery and Infant School","Maintained Primary","pri",0,null,3732014,"Brightside Nursery Inf School","Primary",0,0]
[3732246,107037,"Brook House Junior School",null,"72246",2246,null,0,"Primary","Maintained Primary","Westfield",null,0,null,3732246,"Brook House Junior School","Maintained Primary","pri",0,null,3732246,"Brook House Junior School","Primary",0,0]
[3735204,107154,"Broomhill Infant School",null,"75204",5204,null,0,"Primary","Maintained Primary","King Edward",null,0,null,3735204,"Broomhill Infant School","Maintained Primary","pri",0,null,3735204,"Broomhill Infant School","Primary",0,0]
[3732325,107069,"Brunswick Community Primary School",null,"72325",2325,null,0,"Primary","Maintained Primary","Handsworth Grange",null,0,null,3732325,"Brunswick Community Primary School","Maintained Primary","pri",0,null,3732325,"Brunswick Community Primary","Primary",0,0]
[3732095,107008,"Byron Wood Primary School",null,"72095",2095,null,0,"Primary","Maintained Primary","Fir Vale",null,0,null,3732095,"Byron Wood Primary School","Maintained Primary","pri",0,null,3732095,"Byron Wood","Primary",0,0]
[3732344,107087,"Carfield Primary School",null,"72344",2344,null,0,"Primary","Maintained Primary","Newfield",null,0,null,3732344,"Carfield Primary School","Maintained Primary","pri",0,null,3732344,"Carfield Primary School","Primary",0,0]
[3732023,106988,"Carter Knowle Junior School",null,"72023",2023,null,0,"Primary","Maintained Primary","King Ecgbert",null,0,null,3732023,"Carter Knowle Junior School","Maintained Primary","pri",0,null,3732023,"Carter Knowle Junior","Primary",0,0]
[3732354,107097,"Charnock Hall Primary School",null,"72354",2354,null,0,"Primary","Maintained Primary","Birley",null,0,null,3732354,"Charnock Hall Primary School","Maintained Primary","pri",0,null,3732354,"Charnock Hall Primary School","Primary",0,0]
[3735200,107150,"Clifford CofE Infant School",null,"75200",5200,null,0,"Primary","Maintained Primary","King Edward",null,0,null,3735200,"Clifford CofE Infant School","Maintained Primary","pri",0,null,3735200,"Clifford C of E Infant School","Primary",0,0]
[3732312,107060,"Coit Primary School",null,"72312",2312,null,0,"Primary","Maintained Primary","Ecclesfield",null,0,null,3732312,"Coit Primary School","Maintained Primary","pri",0,null,3732312,"Coit Primary","Primary",0,0]
[3732026,107041,"Concord Junior School",null,"62026",2026,2263,"Recoupment Academy","Primary","Mainstream Academy","Hinde House",null,2263,null,3732026,"Concord Junior School","Mainstream Academy","pri",0,null,3732026,"Concord Junior School","Primary","Recoupment Academy",0]
[3733422,107117,"Deepcar St John's Church of England Junior School",null,"73422",3422,null,0,"Primary","Maintained Primary","Stocksbridge",null,0,null,3733422,"Deepcar St John's Church of England Junior School","Maintained Primary","pri",0,null,3733422,"Deepcar St John's C E Jnr Sch","Primary",0,0]
[3732283,107048,"Dobcroft Infant School",null,"72283",2283,null,0,"Primary","Maintained Primary","Silverdale",null,0,null,3732283,"Dobcroft Infant School","Maintained Primary","pri",0,null,3732283,"Dobcroft Infant School","Primary",0,0]
[3732239,107035,"Dobcroft Junior School",null,"72239",2239,null,0,"Primary","Maintained Primary","Silverdale",null,0,null,3732239,"Dobcroft Junior School","Maintained Primary","pri",0,null,3732239,"Dobcroft Junior School","Primary",0,0]
[3732364,132152,"Dore Primary School",null,"72364",2364,null,0,"Primary","Maintained Primary","King Ecgbert",null,0,null,3732364,"Dore Primary School","Maintained Primary","pri",0,null,3732364,"Dore Primary School","Primary",0,0]
[3733008,107105,"Ecclesall Church of England Junior School",null,"73008",3008,null,0,"Primary","Maintained Primary","High Storrs",null,0,null,3733008,"Ecclesall Church of England Junior School","Maintained Primary","pri",0,null,3733008,"Ecclesall CE Junior School","Primary",0,0]
[3732206,107025,"Ecclesall Infant School",null,"72206",2206,null,0,"Primary","Maintained Primary","High Storrs",null,0,null,3732206,"Ecclesall Infant School","Maintained Primary","pri",0,null,3732206,"Ecclesall Infant School","Primary",0,0]
[3732080,107001,"Ecclesfield Primary School",null,"72080",2080,null,0,"Primary","Maintained Primary","Ecclesfield",null,0,null,3732080,"Ecclesfield Primary School","Maintained Primary","pri",0,null,3732080,"Ecclesfield Primary School","Primary",0,0]
[3733426,107120,"Emmanuel Anglican/Methodist Junior School",null,"73426",3426,null,0,"Primary","Maintained Primary","Westfield",null,0,null,3733426,"Emmanuel Anglican/Methodist Junior School","Maintained Primary","pri",0,null,3733426,"Emmanuel Junior School (Anglican Methodist Aided)","Primary",0,0]
[3732028,134231,"Emmaus Catholic and CofE Primary School",null,"62028",2028,3430,"Recoupment Academy","Primary","Mainstream Academy","Park Academy",null,3430,null,3732028,"Emmaus Catholic and CofE Primary School","Mainstream Academy","pri",0,null,3732028,"Emmaus Catholic and Church of England Primary School","Primary","Recoupment Academy",0]
[3732365,133325,"Firs Hill Community Primary School",null,"72365",2365,null,0,"Primary","Maintained Primary","Fir Vale",null,0,null,3732365,"Firs Hill Community Primary School","Maintained Primary","pri",0,null,3732365,"Firs Hill Community Primary","Primary",0,0]
[3732010,139134,"Fox Hill Primary",null,"62010",2010,2330,"Recoupment Academy","Primary","Mainstream Academy","Yewlands",null,2330,null,3732010,"Fox Hill Primary","Mainstream Academy","pri",0,null,3732010,"Fox Hill Primary School","Primary","Recoupment Academy",0]
[3732036,106991,"Gleadless Primary School",null,"72036",2036,null,0,"Primary","Maintained Primary","Birley",null,0,null,3732036,"Gleadless Primary School","Maintained Primary","pri",0,null,3732036,"Gleadless Primary School","Primary",0,0]
[3732305,139297,"Greengate Lane Academy",null,"62305",2305,null,"Recoupment Academy","Primary","Mainstream Academy","Ecclesfield",null,0,null,3732305,"Greengate Lane Academy","Mainstream Academy","pri",0,null,3732305,"Greengate Lane Academy","Primary","Recoupment Academy",0]
{"$rows_left_out":134}